BDBM144434 US8969394, 6
SMILES COC(=O)c1ccc(cc1)[C@H](C)NC(=O)c1c(Cl)sc(Cl)c1Cc1cccc(Cl)c1
InChI Key InChIKey=SMQMCNFEOUIGIM-LBPRGKRZSA-N
Data  1 KI
  Tab Delimited (TSV)   2D SDfile   Computed 3D by Vconf -m prep SDfile
Find this compound or compounds like it in BindingDB:
Activity Spreadsheet -- Enzyme Inhibition Constant Data from BindingDB
Found 1 hit for monomerid = 144434
TargetProstaglandin E2 receptor EP4 subtype(Homo sapiens (Human))
Merck Frosst Canada
US Patent
LigandPNGBDBM144434(US8969394, 6)
Affinity DataKi:  124nM ΔG°:  -9.42kcal/molepH: 6.0 T: 2°C. Assay description: Transfected HEK 293(ebna) cells are maintained in culture, harvested and membranes are prepared by differential centrifugation, following lysis of th...
In DepthDetails US Patent