BDBM144443 US8969394, 18
SMILES C[C@H](NC(=O)c1c(C)sc(C)c1Cc1ccc(cc1)C(F)(F)F)c1ccc(cc1)C(=O)NS(C)(=O)=O
InChI Key InChIKey=LRAMPOFRCGKEAQ-AWEZNQCLSA-N
Data  1 KI
  Tab Delimited (TSV)   2D SDfile   Computed 3D by Vconf -m prep SDfile
Find this compound or compounds like it in BindingDB:
Activity Spreadsheet -- Enzyme Inhibition Constant Data from BindingDB
Found 1 hit for monomerid = 144443
TargetProstaglandin E2 receptor EP4 subtype(Homo sapiens (Human))
Merck Frosst Canada
US Patent
LigandPNGBDBM144443(US8969394, 18)
Affinity DataKi:  308nM ΔG°:  -8.88kcal/molepH: 6.0 T: 2°C. Assay description: Transfected HEK 293(ebna) cells are maintained in culture, harvested and membranes are prepared by differential centrifugation, following lysis of th...
In DepthDetails US Patent