BDBM14732 1-N-[5-Sulfamoyl-1,3,4-thiadiazol-2-yl-(aminosulfonyl-4-phenyl)]-2-tert-butyl-4,6-diphenylpyridinium perchlorate::2-tert-butyl-4,6-diphenyl-1-{4-[(5-sulfamoyl-1,3,4-thiadiazol-2-yl)sulfamoyl]phenyl}-1-pyridin-1-ylium perchlorate::pyridinium-containing sulfonamide analog 14p
SMILES CC(C)(C)c1cc(cc(-c2ccccc2)[n+]1-c1ccc(cc1)S(=O)(=O)Nc1nnc(s1)S(N)(=O)=O)-c1ccccc1
InChI Key InChIKey=VPTXVOFVTSHNSY-UHFFFAOYSA-N
Data  4 KI
  Tab Delimited (TSV)   2D SDfile   Computed 3D by Vconf -m prep SDfile
Find this compound or compounds like it in BindingDB:
Activity Spreadsheet -- Enzyme Inhibition Constant Data from BindingDB
Found 4 hits for monomerid = 14732
TargetCarbonic anhydrase 2(Homo sapiens (Human))
Canadian Institutes of Health Research
LigandPNGBDBM14732(1-N-[5-Sulfamoyl-1,3,4-thiadiazol-2-yl-(aminosulfo...)
Affinity DataKi:  4.11nM. Assay description: Initial rates of 4-nitrophenyl acetate hydrolysis catalyzed by different CA isozymes were monitored spectrophotometrically at 400 nm. A molar absorpt...
In DepthDetails ArticlePubMed
TargetCarbonic anhydrase 4(Bos taurus (bovine))
Canadian Institutes of Health Research
LigandPNGBDBM14732(1-N-[5-Sulfamoyl-1,3,4-thiadiazol-2-yl-(aminosulfo...)
Affinity DataKi:  7nM. Assay description: Initial rates of 4-nitrophenyl acetate hydrolysis catalyzed by different CA isozymes were monitored spectrophotometrically at 400 nm. A molar absorpt...
In DepthDetails ArticlePubMed
TargetCarbonic anhydrase 1(Homo sapiens (Human))
Canadian Institutes of Health Research
LigandPNGBDBM14732(1-N-[5-Sulfamoyl-1,3,4-thiadiazol-2-yl-(aminosulfo...)
Affinity DataKi:  12nM ΔG°:  -10.8kcal/molepH: 7.5 T: 2°C. Assay description: Initial rates of 4-nitrophenyl acetate hydrolysis catalyzed by different CA isozymes were monitored spectrophotometrically at 400 nm. A molar absorpt...
In DepthDetails ArticlePubMed
TargetCarbonic anhydrase 9(Homo sapiens (Human))
Canadian Institutes of Health Research
LigandPNGBDBM14732(1-N-[5-Sulfamoyl-1,3,4-thiadiazol-2-yl-(aminosulfo...)
Affinity DataKi:  43nM. Assay description: An Applied Photophysics stopped-flow instrument has been used for assaying the CA-catalyzed CO2 hydration activity. Phenol red has been used as indic...
In DepthDetails ArticlePubMed