BDBM149348 US8962859, 8B
SMILES NC1=N[C@]2(c3nccn13)c1cc(ccc1Oc1c(F)cc(cc21)-c1ccnc(F)c1)-c1cccnc1F
InChI Key InChIKey=VTTLVOMLUUKPMB-HHHXNRCGSA-N
Data  1 IC50
  Tab Delimited (TSV)   2D SDfile   Computed 3D by Vconf -m prep SDfile
Find this compound or compounds like it in BindingDB:
Activity Spreadsheet -- Enzyme Inhibition Constant Data from BindingDB
Found 1 hit for monomerid = 149348
TargetBeta-secretase 1(Homo sapiens (Human))
Amgen
US Patent
LigandPNGBDBM149348(US8962859, 8B)
Affinity DataIC50:  0.300nMpH: 4.2Assay Description:The assay buffer used in this screen is 0.05 M acetate, pH 4.2, 10% DMSO final, 100 uM genapol (which is a nonionic detergent, below its Critical Mic...
In DepthDetails US Patent