BDBM151655 US8987445, 61
SMILES Cc1c(ncc2ccccc12)N(Cc1ccc2c(CCC2(C)C)c1)S(=O)(=O)c1ccc(cc1)C(O)=O
InChI Key InChIKey=TXMQIHYKAVMTEJ-UHFFFAOYSA-N
Data  1 IC50
  Tab Delimited (TSV)   2D SDfile   Computed 3D by Vconf -m prep SDfile
Find this compound or compounds like it in BindingDB:
Activity Spreadsheet -- Enzyme Inhibition Constant Data from BindingDB
Found 1 hit for monomerid = 151655
TargetTransient receptor potential cation channel subfamily M member 8(Homo sapiens (Human))
Mitsubishi Tanabe Pharma
US Patent
LigandPNGBDBM151655(US8987445, 61)
Affinity DataIC50:  1.30nMT: 2°C. Assay description: The functional activity of compounds was determined by measuring changes in intracellular calcium concentration using a Ca2+ sensitive fluorescent dy...
In DepthDetails US Patent