BDBM151748 US8987445, 184
SMILES OC(=O)c1ccc(cc1)S(=O)(=O)N(Cc1cc2c(F)cc(F)cc2s1)c1ncc2ccccc2c1C1CC1
InChI Key InChIKey=NNGBVZQEXQLSPG-UHFFFAOYSA-N
Data  1 IC50
  Tab Delimited (TSV)   2D SDfile   Computed 3D by Vconf -m prep SDfile
Find this compound or compounds like it in BindingDB:
Activity Spreadsheet -- Enzyme Inhibition Constant Data from BindingDB
Found 1 hit for monomerid = 151748
TargetTransient receptor potential cation channel subfamily M member 8(Homo sapiens (Human))
Mitsubishi Tanabe Pharma
US Patent
LigandPNGBDBM151748(US8987445, 184)
Affinity DataIC50:  1.10nMT: 2°C. Assay description: The functional activity of compounds was determined by measuring changes in intracellular calcium concentration using a Ca2+ sensitive fluorescent dy...
In DepthDetails US Patent