BDBM151749 US8987445, 185
SMILES FC(F)(C1CC1)c1ccc(CN(c2ncc3ccccc3c2C2CC2)S(=O)(=O)c2ccc(cc2)C(=O)O[Na])cc1Cl
InChI Key InChIKey=BQYTUZXGABHMCN-UHFFFAOYSA-M
Data  1 IC50
  Tab Delimited (TSV)   2D SDfile   Computed 3D by Vconf -m prep SDfile
Find this compound or compounds like it in BindingDB:
Activity Spreadsheet -- Enzyme Inhibition Constant Data from BindingDB
Found 1 hit for monomerid = 151749
TargetTransient receptor potential cation channel subfamily M member 8(Homo sapiens (Human))
Mitsubishi Tanabe Pharma
US Patent
LigandPNGBDBM151749(US8987445, 185)
Affinity DataIC50:  1.20nMT: 2°C. Assay description: The functional activity of compounds was determined by measuring changes in intracellular calcium concentration using a Ca2+ sensitive fluorescent dy...
In DepthDetails US Patent