BDBM151765 US8987445, 201
SMILES Cc1c(ncc2ccccc12)N(Cc1ccc(c(Cl)c1)C(F)(F)C1CC1)S(=O)(=O)c1ccc(cc1)C(O)=O
InChI Key InChIKey=RWDVLHZFVUVTNK-UHFFFAOYSA-N
Data  1 IC50
  Tab Delimited (TSV)   2D SDfile   Computed 3D by Vconf -m prep SDfile
Find this compound or compounds like it in BindingDB:
Activity Spreadsheet -- Enzyme Inhibition Constant Data from BindingDB
Found 1 hit for monomerid = 151765
TargetTransient receptor potential cation channel subfamily M member 8(Homo sapiens (Human))
Mitsubishi Tanabe Pharma
US Patent
LigandPNGBDBM151765(US8987445, 201)
Affinity DataIC50:  0.600nMT: 2°C. Assay description: The functional activity of compounds was determined by measuring changes in intracellular calcium concentration using a Ca2+ sensitive fluorescent dy...
In DepthDetails US Patent