BDBM152538 10-(4-Methylbenzyl)benzo[g]pteridine-2,4(3H,10H)-dione (7f)
SMILES Cc1ccc(Cn2c3ccccc3nc3c2nc(=O)[nH]c3=O)cc1
InChI Key InChIKey=GTSOVRGYRBDAAM-UHFFFAOYSA-N
Data  2 IC50
  Tab Delimited (TSV)   2D SDfile   Computed 3D by Vconf -m prep SDfile
Find this compound or compounds like it in BindingDB:
Activity Spreadsheet -- Enzyme Inhibition Constant Data from BindingDB
Found 1 hit for monomerid = 152538
TargetAcetylcholinesterase(Homo sapiens (Human))
The M. S. University of Baroda
LigandPNGBDBM152538(10-(4-Methylbenzyl)benzo[g]pteridine-2,4(3H,10H)-d...)
Affinity DataIC50:  2.94E+4nMpH: 8.0 T: 2°C. Assay description: Suitable agents like donepezil hydrochloride and tacrine hydrochloride hydrate were used as standards for this study. Buffer solution (50 mM Tris-HCl...
In DepthDetails ArticlePubMed