BDBM152635 (2E)-3-(4-fluorophenyl)-1-(4-methoxyphenyl)prop-2-en-1-one (M3)
SMILES COc1ccc(cc1)C(=O)\C=C\c1ccc(F)cc1
InChI Key InChIKey=OAJAFWHLVBVKQH-NYYWCZLTSA-N
Data  2 KI
  Tab Delimited (TSV)   2D SDfile   Computed 3D by Vconf -m prep SDfile
Find this compound or compounds like it in BindingDB:
Activity Spreadsheet -- Enzyme Inhibition Constant Data from BindingDB
Found 2 hits for monomerid = 152635
TargetAmine oxidase [flavin-containing] B(Homo sapiens (Human))
Grace College of Pharmacy
LigandPNGBDBM152635((2E)-3-(4-fluorophenyl)-1-(4-methoxyphenyl)prop-2-...)
Affinity DataKi:  270nMpH: 7.4Assay Description:Study medium contained 0.1 mL of sodium phosphate buffer (0.05 M, pH 7.4), various concentrations of the newly synthesized compounds or reference com...
In DepthDetails ArticlePubMed
TargetAmine oxidase [flavin-containing] A(Homo sapiens (Human))
Grace College of Pharmacy
LigandPNGBDBM152635((2E)-3-(4-fluorophenyl)-1-(4-methoxyphenyl)prop-2-...)
Affinity DataKi:  2.39E+3nMpH: 7.4Assay Description:Study medium contained 0.1 mL of sodium phosphate buffer (0.05 M, pH 7.4), various concentrations of the newly synthesized compounds or reference com...
In DepthDetails ArticlePubMed