BDBM15277 7-chloro-8-[(1H-imidazol-4-ylmethyl)amino]-3-oxo-11,17-dioxa-2,4,20,22-tetraazatricyclo[16.3.1.0^{5,10}]docosa-1(21),5(10),6,8,18(22),19-hexaene-19-carbonitrile::macrocyclic inhibitor 17j
SMILES Clc1cc2NC(=O)Nc3cnc(C#N)c(OCCCCCOc2cc1NCc1cnc[nH]1)n3
InChI Key InChIKey=UGYITSJCJJXPMG-UHFFFAOYSA-N
Data  1 IC50
  Tab Delimited (TSV)   2D SDfile   Computed 3D by Vconf -m prep SDfile
Find this compound or compounds like it in BindingDB:
Activity Spreadsheet -- Enzyme Inhibition Constant Data from BindingDB
Found 1 hit for monomerid = 15277
TargetSerine/threonine-protein kinase Chk1(Homo sapiens (Human))
Abbott Laboratories
LigandPNGBDBM15277(7-chloro-8-[(1H-imidazol-4-ylmethyl)amino]-3-oxo-1...)
Affinity DataIC50:  231nM. Assay description: Chk1 kinase activity was assayed in reaction buffer containing substrate, enzyme, and inhibitor in the presence of 5uM ATP/[gamma-33P] ATP. 33P incor...
In DepthDetails ArticlePubMed