BDBM154251 US9012443, 267
SMILES COc1cc(Cl)ccc1-c1ncnc2cc(ccc12)S(=O)(=O)Nc1nccs1
InChI Key InChIKey=CGRLWCROSGLCNV-UHFFFAOYSA-N
Data  2 IC50
  Tab Delimited (TSV)   2D SDfile   Computed 3D by Vconf -m prep SDfile
Find this compound or compounds like it in BindingDB:
Activity Spreadsheet -- Enzyme Inhibition Constant Data from BindingDB
Found 2 hits for monomerid = 154251
TargetSodium channel protein type 9 subunit alpha(Homo sapiens (Human))
Amgen
US Patent
LigandPNGBDBM154251(US9012443, 267)
Affinity DataIC50:  300nM. Assay description: 293 cells stably transfected with human Nav1.7 were recorded in whole cell voltage clamp mode with the PatchXpress automated electrophysiology system...
In DepthDetails US Patent
TargetSodium channel protein type 9 subunit alpha(Homo sapiens (Human))
Amgen
US Patent
LigandPNGBDBM154251(US9012443, 267)
Affinity DataIC50:  10nM. Assay description: 293 Cells stably transfected with either Nav 1.7 or Nav 1.5 were recorded in population patch-clamp mode with the IonWorks Quattro automated electrop...
In DepthDetails US Patent