BDBM15535 (3R)-4-[(3R)-3-amino-4-(2,4,5-trifluorophenyl)butanoyl]-1-(2-hydroxyethyl)-3-methyl-1,4-diazepan-2-one::1-substituted diazepanone 9f
SMILES C[C@H]1N(CCCN(CCO)C1=O)C(=O)C[C@H](N)Cc1cc(F)c(F)cc1F
InChI Key InChIKey=HTSLDXVXLFGMNX-DGCLKSJQSA-N
Data  3 IC50
  Tab Delimited (TSV)   2D SDfile   Computed 3D by Vconf -m prep SDfile
Find this compound or compounds like it in BindingDB:
Activity Spreadsheet -- Enzyme Inhibition Constant Data from BindingDB
Found 3 hits for monomerid = 15535
TargetDipeptidyl peptidase 4(Homo sapiens (Human))
Merck Research Laboratories
LigandPNGBDBM15535((3R)-4-[(3R)-3-amino-4-(2,4,5-trifluorophenyl)buta...)
Affinity DataIC50:  15.1nMpH: 7.5 T: 2°C. Assay description: The enzyme activity resulted in the formation of the fluorescent product amidomethylcoumarin (AMC), which was monitored by excitation at 360 nm and m...
In DepthDetails ArticlePubMed
TargetDipeptidyl peptidase 8(Homo sapiens (Human))
Merck Research Laboratories
LigandPNGBDBM15535((3R)-4-[(3R)-3-amino-4-(2,4,5-trifluorophenyl)buta...)
Affinity DataIC50:  5.30E+4nM. Assay description: The enzyme activity resulted in the formation of the fluorescent product amidomethylcoumarin (AMC), which was monitored by excitation at 360 nm and m...
In DepthDetails ArticlePubMed
TargetDipeptidyl peptidase 2(Homo sapiens (Human))
Merck Research Laboratories
LigandPNGBDBM15535((3R)-4-[(3R)-3-amino-4-(2,4,5-trifluorophenyl)buta...)
Affinity DataIC50:  7.80E+4nM. Assay description: The enzyme activity resulted in the formation of the fluorescent product amidomethylcoumarin (AMC), which was monitored by excitation at 360 nm and m...
In DepthDetails ArticlePubMed