BDBM155411 US9006454, I21
SMILES OC(=O)c1cccc2[nH]c(nc12)-c1c(F)c(F)c(-c2ccccc2)c(F)c1F
InChI Key InChIKey=IKHBMNRPSPINLM-UHFFFAOYSA-N
Data  1 IC50
  Tab Delimited (TSV)   2D SDfile   Computed 3D by Vconf -m prep SDfile
Find this compound or compounds like it in BindingDB:
Activity Spreadsheet -- Enzyme Inhibition Constant Data from BindingDB
Found 1 hit for monomerid = 155411
TargetDihydroorotate dehydrogenase (quinone), mitochondrial(Homo sapiens (Human))
Merck Serono
US Patent
LigandPNGBDBM155411(US9006454, I21)
Affinity DataIC50:  38nMpH: 8.0Assay Description:The DHODH activity assay is a coupled enzyme assay in which oxidation of DHO and subsequent reduction of ubiquinone are stoichiometrically equivalent...
In DepthDetails US Patent