BDBM15546 (3R,7S)-4-[(3R)-3-amino-4-(2,4,5-trifluorophenyl)butanoyl]-3,7-dimethyl-1,4-diazepan-2-one::7-methyl diazepanone 15b
SMILES C[C@H]1CCN([C@H](C)C(=O)N1)C(=O)C[C@H](N)Cc1cc(F)c(F)cc1F
InChI Key InChIKey=VHJSJQMPRBFSGP-HOSYDEDBSA-N
Data  3 IC50
  Tab Delimited (TSV)   2D SDfile   Computed 3D by Vconf -m prep SDfile
Find this compound or compounds like it in BindingDB:
Activity Spreadsheet -- Enzyme Inhibition Constant Data from BindingDB
Found 3 hits for monomerid = 15546
TargetDipeptidyl peptidase 4(Homo sapiens (Human))
Merck Research Laboratories
LigandPNGBDBM15546((3R,7S)-4-[(3R)-3-amino-4-(2,4,5-trifluorophenyl)b...)
Affinity DataIC50:  397nM. Assay description: The enzyme activity resulted in the formation of the fluorescent product amidomethylcoumarin (AMC), which was monitored by excitation at 360 nm and m...
In DepthDetails ArticlePubMed
TargetDipeptidyl peptidase 8(Homo sapiens (Human))
Merck Research Laboratories
LigandPNGBDBM15546((3R,7S)-4-[(3R)-3-amino-4-(2,4,5-trifluorophenyl)b...)
Affinity DataIC50:  7.00E+4nM. Assay description: The enzyme activity resulted in the formation of the fluorescent product amidomethylcoumarin (AMC), which was monitored by excitation at 360 nm and m...
In DepthDetails ArticlePubMed
TargetDipeptidyl peptidase 2(Homo sapiens (Human))
Merck Research Laboratories
LigandPNGBDBM15546((3R,7S)-4-[(3R)-3-amino-4-(2,4,5-trifluorophenyl)b...)
Affinity DataIC50:  7.30E+4nM. Assay description: The enzyme activity resulted in the formation of the fluorescent product amidomethylcoumarin (AMC), which was monitored by excitation at 360 nm and m...
In DepthDetails ArticlePubMed