BDBM155498 US9006454, I140
SMILES Cc1cc(C(O)=O)c2nc([nH]c2c1)-c1c(F)c(F)c(c(F)c1F)-c1ccccc1F
InChI Key InChIKey=VCCNLDRHEVXGAJ-UHFFFAOYSA-N
Data  1 IC50
  Tab Delimited (TSV)   2D SDfile   Computed 3D by Vconf -m prep SDfile
Find this compound or compounds like it in BindingDB:
Activity Spreadsheet -- Enzyme Inhibition Constant Data from BindingDB
Found 1 hit for monomerid = 155498
TargetDihydroorotate dehydrogenase (quinone), mitochondrial(Homo sapiens (Human))
Merck Serono
US Patent
LigandPNGBDBM155498(US9006454, I140)
Affinity DataIC50:  3.5nMpH: 8.0Assay Description:The DHODH activity assay is a coupled enzyme assay in which oxidation of DHO and subsequent reduction of ubiquinone are stoichiometrically equivalent...
In DepthDetails US Patent