BDBM155499 US9006454, I141
SMILES Cc1cc(C(O)=O)c2nc([nH]c2c1)-c1c(F)c(F)c(-c2cccnc2)c(F)c1F
InChI Key InChIKey=GYUZUNLYAOOIMP-UHFFFAOYSA-N
Data  1 IC50
  Tab Delimited (TSV)   2D SDfile   Computed 3D by Vconf -m prep SDfile
Find this compound or compounds like it in BindingDB:
Activity Spreadsheet -- Enzyme Inhibition Constant Data from BindingDB
Found 1 hit for monomerid = 155499
TargetDihydroorotate dehydrogenase (quinone), mitochondrial(Homo sapiens (Human))
Merck Serono
US Patent
LigandPNGBDBM155499(US9006454, I141)
Affinity DataIC50:  32nMpH: 8.0Assay Description:The DHODH activity assay is a coupled enzyme assay in which oxidation of DHO and subsequent reduction of ubiquinone are stoichiometrically equivalent...
In DepthDetails US Patent