BDBM15595 (2-phenylethyl)(1H-pyrrol-2-ylmethyl)amine::N-(2-Phenylethyl),N-(pyrrol-2-ylmethyl)amine::pyrrole inhibitor 20
SMILES C(Cc1ccccc1)NCc1ccc[nH]1
InChI Key InChIKey=HKFLTDDIRURSLM-UHFFFAOYSA-N
Data  3 KI
  Tab Delimited (TSV)   2D SDfile   Computed 3D by Vconf -m prep SDfile
Find this compound or compounds like it in BindingDB:
Activity Spreadsheet -- Enzyme Inhibition Constant Data from BindingDB
Found 3 hits for monomerid = 15595
TargetAmine oxidase [flavin-containing] A(Bos taurus)
Sapienza University of Rome
LigandPNGBDBM15595((2-phenylethyl)(1H-pyrrol-2-ylmethyl)amine | N-(2-...)
Affinity DataKi:  20nM ΔG°:  -11.0kcal/molepH: 7.4 T: 2°C. Assay description: MAO A and MAO B activities were determined spectrophotometrically using kinuramine as substrates. Fluorimetric measurements were recorded with a Perk...
In DepthDetails ArticlePubMed
TargetAmine oxidase [flavin-containing] B(Bos taurus)
Sapienza University of Rome
LigandPNGBDBM15595((2-phenylethyl)(1H-pyrrol-2-ylmethyl)amine | N-(2-...)
Affinity DataKi:  700nM. Assay description: MAO A and MAO B activities were determined spectrophotometrically using kinuramine as substrates. Fluorimetric measurements were recorded with a Perk...
In DepthDetails ArticlePubMed
TargetAmine oxidase [flavin-containing] A(Homo sapiens (Human))
Bharati Vidyapeeth Deemed University
Curated by ChEMBL
LigandPNGBDBM15595((2-phenylethyl)(1H-pyrrol-2-ylmethyl)amine | N-(2-...)
Affinity DataKi:  2.00E+7nM. Assay description: Inhibition of MAO-A receptor
In DepthDetails ArticlePubMed