BDBM155955 US9018214, 6
SMILES C[C@@H]1CN(CC(=O)N2CCc3ccc(C)cc23)CCN1
InChI Key InChIKey=OHNGWVZUUYBPTF-CYBMUJFWSA-N
Data  3 IC50
  Tab Delimited (TSV)   2D SDfile   Computed 3D by Vconf -m prep SDfile
Find this compound or compounds like it in BindingDB:
Activity Spreadsheet -- Enzyme Inhibition Constant Data from BindingDB
Found 3 hits for monomerid = 155955
TargetE3 ubiquitin-protein ligase XIAP(Homo sapiens (Human))
Astex Therapeutics
US Patent
LigandPNGBDBM155955(US9018214, 6)
Affinity DataIC50:  5.10E+4nMpH: 7.5 T: 2°C. Assay description: Modified SMAC peptides and compounds were tested for their ability to displace the fluorescent tracer from either XIAP, clAP-1 or clAP-2. BIR3 domain...
In DepthDetails US Patent
TargetE3 ubiquitin-protein ligase XIAP(Homo sapiens (Human))
Astex Therapeutics
US Patent
LigandPNGBDBM155955(US9018214, 6)
Affinity DataIC50:  4.60E+4nM. Assay description: Antagonist activity at XIAP-BIR3 domain (unknown origin) assessed as inhibition of interaction with SMAC by fluorescence polarization assay
In DepthDetails ArticlePubMed
TargetBaculoviral IAP repeat-containing protein 2(Homo sapiens (Human))
Astex Therapeutics
US Patent
LigandPNGBDBM155955(US9018214, 6)
Affinity DataIC50:  9.50E+4nMpH: 7.5 T: 2°C. Assay description: Modified SMAC peptides and compounds were tested for their ability to displace the fluorescent tracer from either XIAP, clAP-1 or clAP-2. BIR3 domain...
In DepthDetails US Patent