BDBM155993 US9018214, 44
SMILES COC[C@H]1CN[C@H](C)CN1CC(=O)N1CC(C)(C)c2ccc(Cl)cc12
InChI Key InChIKey=ZKLPYFFPWPJFDT-UKRRQHHQSA-N
Data  4 IC50
  Tab Delimited (TSV)   2D SDfile   Computed 3D by Vconf -m prep SDfile
Find this compound or compounds like it in BindingDB:
Activity Spreadsheet -- Enzyme Inhibition Constant Data from BindingDB
Found 4 hits for monomerid = 155993
TargetE3 ubiquitin-protein ligase XIAP(Homo sapiens (Human))
Astex Therapeutics
US Patent
LigandPNGBDBM155993(US9018214, 44)
Affinity DataIC50:  1.50E+3nMpH: 7.5 T: 2°C. Assay description: Modified SMAC peptides and compounds were tested for their ability to displace the fluorescent tracer from either XIAP, clAP-1 or clAP-2. BIR3 domain...
In DepthDetails US Patent
TargetE3 ubiquitin-protein ligase XIAP(Homo sapiens (Human))
Astex Therapeutics
US Patent
LigandPNGBDBM155993(US9018214, 44)
Affinity DataIC50:  1.50E+3nM. Assay description: Antagonist activity at XIAP-BIR3 domain (unknown origin) assessed as inhibition of interaction with SMAC by fluorescence polarization assay
In DepthDetails ArticlePubMed
TargetBaculoviral IAP repeat-containing protein 2(Homo sapiens (Human))
Astex Pharmaceuticals
Curated by ChEMBL
LigandPNGBDBM155993(US9018214, 44)
Affinity DataIC50:  650nM. Assay description: Antagonist activity at cIAP1-BIR3 domain (unknown origin) assessed as inhibition of interaction with SMAC by fluorescence polarization assay
In DepthDetails ArticlePubMed
TargetBaculoviral IAP repeat-containing protein 2(Homo sapiens (Human))
Astex Pharmaceuticals
Curated by ChEMBL
LigandPNGBDBM155993(US9018214, 44)
Affinity DataIC50:  650nMpH: 7.5 T: 2°C. Assay description: Modified SMAC peptides and compounds were tested for their ability to displace the fluorescent tracer from either XIAP, clAP-1 or clAP-2. BIR3 domain...
In DepthDetails US Patent