BDBM15608 CHEMBL353159::N-Methyl,N-propargyl-1H-pyrrole-2-carboxamide::N-methyl-N-(prop-2-yn-1-yl)-1H-pyrrole-2-carboxamide::pyrrole inhibitor 33
SMILES CN(CC#C)C(=O)c1ccc[nH]1
InChI Key InChIKey=IKQLCRCMGYGVMD-UHFFFAOYSA-N
Data  6 KI
  Tab Delimited (TSV)   2D SDfile   Computed 3D by Vconf -m prep SDfile
Find this compound or compounds like it in BindingDB:
Activity Spreadsheet -- Enzyme Inhibition Constant Data from BindingDB
Found 6 hits for monomerid = 15608
TargetAmine oxidase [flavin-containing] A(Bos taurus)
Padmashri Vikhe Patil College
Curated by ChEMBL
LigandPNGBDBM15608(CHEMBL353159 | N-Methyl,N-propargyl-1H-pyrrole-2-c...)
Affinity DataKi:  5.40nM. Assay description: Inhibition of bovine MAO-A using kinuramine as substrate by fluorometric method
In DepthDetails ArticlePubMed
TargetAmine oxidase [flavin-containing] A(Bos taurus)
Padmashri Vikhe Patil College
Curated by ChEMBL
LigandPNGBDBM15608(CHEMBL353159 | N-Methyl,N-propargyl-1H-pyrrole-2-c...)
Affinity DataKi:  75nM. Assay description: Inhibitory activity against monoamine oxidase A in isolated bovine brain mitochondria
In DepthDetails ArticlePubMed
TargetAmine oxidase [flavin-containing] A(Bos taurus)
Padmashri Vikhe Patil College
Curated by ChEMBL
LigandPNGBDBM15608(CHEMBL353159 | N-Methyl,N-propargyl-1H-pyrrole-2-c...)
Affinity DataKi:  75nM. Assay description: MAO A and MAO B activities were determined spectrophotometrically using kinuramine as substrates. Fluorimetric measurements were recorded with a Perk...
In DepthDetails ArticlePubMed
TargetAmine oxidase [flavin-containing] B(Bos taurus)
Sapienza University of Rome
LigandPNGBDBM15608(CHEMBL353159 | N-Methyl,N-propargyl-1H-pyrrole-2-c...)
Affinity DataKi:  5.00E+4nM. Assay description: MAO A and MAO B activities were determined spectrophotometrically using kinuramine as substrates. Fluorimetric measurements were recorded with a Perk...
In DepthDetails ArticlePubMed
TargetAmine oxidase [flavin-containing] B(Bos taurus)
Sapienza University of Rome
LigandPNGBDBM15608(CHEMBL353159 | N-Methyl,N-propargyl-1H-pyrrole-2-c...)
Affinity DataKi:  5.00E+4nM. Assay description: Inhibitory activity against monoamine oxidase B in isolated bovine brain mitochondria
In DepthDetails ArticlePubMed
TargetAmine oxidase [flavin-containing] A(Homo sapiens (Human))
Bharati Vidyapeeth Deemed University
Curated by ChEMBL
LigandPNGBDBM15608(CHEMBL353159 | N-Methyl,N-propargyl-1H-pyrrole-2-c...)
Affinity DataKi:  7.50E+7nM. Assay description: Inhibition of MAO-A receptor
In DepthDetails ArticlePubMed