BDBM156430 US9023354, AD4-12918
SMILES Cc1cccc(NC(c2ccc3cccnc3c2O)c2c(F)c(F)cc(F)c2F)n1
InChI Key InChIKey=YDCZODYBERKOLC-UHFFFAOYSA-N
Data  1 IC50
  Tab Delimited (TSV)   2D SDfile   Computed 3D by Vconf -m prep SDfile
Find this compound or compounds like it in BindingDB:
Activity Spreadsheet -- Enzyme Inhibition Constant Data from BindingDB
Found 1 hit for monomerid = 156430
TargetE3 ubiquitin-protein ligase Mdm2(Homo sapiens (Human))
TBA
US Patent
LigandPNGBDBM156430(US9023354, AD4-12918)
Affinity DataIC50:  5.20E+3nMT: 2°C. Assay description: The following example describes an assay that measured the ability of compounds to inhibit the binding of p53 to MDM2 using the AlphaScreen assay tec...
In DepthDetails US Patent