BDBM157150 US9023849, 21
SMILES CC1(C)C(=O)Nc2nc(nnc12)-n1nc(Cc2ccccc2F)c2cc(F)ccc12
InChI Key InChIKey=PGQZAFWOZDGNDB-UHFFFAOYSA-N
Data  1 IC50
  Tab Delimited (TSV)   2D SDfile   Computed 3D by Vconf -m prep SDfile
Find this compound or compounds like it in BindingDB:
Activity Spreadsheet -- Enzyme Inhibition Constant Data from BindingDB
Found 1 hit for monomerid = 157150
TargetcGMP-specific 3',5'-cyclic phosphodiesterase(Homo sapiens (Human))
Bayer Intellectual Property
US Patent
LigandPNGBDBM157150(US9023849, 21)
Affinity DataIC50:  75nMpH: 7.5Assay Description:To determine their in vitro action on human PDE 5, the test substances are dissolved in 100% DMSO and serially diluted. Typically, dilution series (1...
In DepthDetails US Patent