BDBM160301 US9040691, 29
SMILES COc1cc(cc(F)c1CO)-c1cc([C@H]2CC[C@H](O)CC2)n2ncnc(N)c12
InChI Key InChIKey=RWORSPWJUTVGBW-AULYBMBSSA-N
Data  1 IC50
  Tab Delimited (TSV)   2D SDfile   Computed 3D by Vconf -m prep SDfile
Find this compound or compounds like it in BindingDB:
Activity Spreadsheet -- Enzyme Inhibition Constant Data from BindingDB
Found 1 hit for monomerid = 160301
TargetSerine/threonine-protein kinase receptor R3(Homo sapiens (Human))
Bayer Intellectual Property
US Patent
LigandPNGBDBM160301(US9040691, 29)
Affinity DataIC50:  1nM. Assay description: In vitro enzyme inhibition using scintillation of incorporated radio label (flashplate assay). Test compounds diluted in DMSO are mixed with a suitab...
In DepthDetails US Patent