BDBM160409 US9040714, 113::US9693992, 113
SMILES COc1cc2c(C)c(-c3ccc(nc3)N3CCN(C)CC3)c(=O)oc2c(C=O)c1O
InChI Key InChIKey=MFIVUCSGGPGGDT-UHFFFAOYSA-N
Data  2 IC50  1 EC50
  Tab Delimited (TSV)   2D SDfile   Computed 3D by Vconf -m prep SDfile
Find this compound or compounds like it in BindingDB:
Activity Spreadsheet -- Enzyme Inhibition Constant Data from BindingDB
Found 1 hit for monomerid = 160409
TargetSerine/threonine-protein kinase/endoribonuclease IRE1(Homo sapiens (Human))
Mannkind
US Patent
LigandPNGBDBM160409(US9040714, 113 | US9693992, 113)
Affinity DataIC50: <100nM EC50: <1.00E+4nMpH: 7.5 T: 2°C. Assay description: A fusion protein comprising glutathione S transferase (GST) and human IRE-1α (GST-IRE-1α) obtained from a 500 ml baculovirus-infected ins...
In DepthDetails US Patent