BDBM160499 US10093663, Example 36::US9682968, Example-36
SMILES CCOC1CCN(Cc2c(OC)cc(C)c3[nH]ccc23)C(C1)c1ccc(cc1)-c1nn[nH]n1
InChI Key
Data  2 IC50
  Tab Delimited (TSV)   2D SDfile   Computed 3D by Vconf -m prep SDfile
Find this compound or compounds like it in BindingDB:
Activity Spreadsheet -- Enzyme Inhibition Constant Data from BindingDB
Found 1 hit for monomerid = 160499
TargetComplement factor B(Homo sapiens (Human))
Novartis
US Patent
LigandPNGBDBM160499(US10093663, Example 36 | US9682968, Example-36)
Affinity DataIC50:  20nMpH: 7.4 T: 2°C. Assay description: CVF-Bb complex prepared from purified cobra venom factor (1 μM), recombinant human complement factor B (expressed in drosophila cells and purifi...
Ligand InfoPC cidPC sid
In DepthDetails US Patent