BDBM16051 (4S)-4-amino-4-{[(1S)-1-{[(1S)-2-carbamoyl-1-{[(1S,2S)-1-[(1R,2R)-2-{[(1S)-1-carboxyethyl]carbamoyl}cyclopentyl]-1-hydroxy-4-methylpentan-2-yl]carbamoyl}ethyl]carbamoyl}-2-methylpropyl]carbamoyl}butanoic acid::L-alpha-glutamyl-L-valyl-N1-{(1S)-1-[(S)-[(1R,2R)-2-{[(1S)-1-carboxyethyl]carbamoyl}cyclopentyl](hydroxy)methyl]-3-methylbutyl}-L-aspartamide::NVP-AMK640::truncated OM99-2 cyclopentano analog 5
SMILES [H][C@]1(CCC[C@H]1C(=O)N[C@@H](C)C(O)=O)[C@H](O)[C@H](CC(C)C)NC(=O)[C@H](CC(N)=O)NC(=O)[C@@H](NC(=O)[C@@H](N)CCC(O)=O)C(C)C
InChI Key InChIKey=WQVHGVDOXBCVGL-ZPWOCEPRSA-N
Data  2 IC50
PDB links: 1 PDB ID matches this monomer.
  Tab Delimited (TSV)   2D SDfile   Computed 3D by Vconf -m prep SDfile
Find this compound or compounds like it in BindingDB:
Activity Spreadsheet -- Enzyme Inhibition Constant Data from BindingDB
Found 2 hits for monomerid = 16051
TargetCathepsin D(Homo sapiens (Human))
Universite De Montreal At Succursale Centre-Ville
LigandPNGBDBM16051((4S)-4-amino-4-{[(1S)-1-{[(1S)-2-carbamoyl-1-{[(1S...)
Affinity DataIC50:  6.00E+3nMT: 2°C. Assay description: Inhibition assays were done in black 96-well plates by adding test compounds to the respective enzyme in assay buffer. Plates were incubated at room ...
In DepthDetails ArticlePubMed
TargetBeta-secretase 1 [1-453](Homo sapiens (Human))
Universite De Montreal At Succursale Centre-Ville
LigandPNGBDBM16051((4S)-4-amino-4-{[(1S)-1-{[(1S)-2-carbamoyl-1-{[(1S...)
Affinity DataIC50:  39nMpH: 4.5 T: 2°C. Assay description: Inhibition assays were done in black 96-well plates by adding test compounds to the respective enzyme in assay buffer. Plates were incubated at room ...