BDBM160654 US9045483, 7
SMILES CCCCn1c(NC(=O)c2ccccc2)c(c2nc3ccccc3nc12)S(=O)(=O)c1ccccc1
InChI Key InChIKey=FITWGNRMVRVCPA-UHFFFAOYSA-N
Data  1 IC50
  Tab Delimited (TSV)   2D SDfile   Computed 3D by Vconf -m prep SDfile
Find this compound or compounds like it in BindingDB:
Activity Spreadsheet -- Enzyme Inhibition Constant Data from BindingDB
Found 1 hit for monomerid = 160654
TargetSUMO-activating enzyme subunit 1/2(Homo sapiens (Human))
City of Hope
US Patent
LigandPNGBDBM160654(US9045483, 7)
Affinity DataIC50:  9.80E+4nM. Assay description: Through the Molecular Library Probe Production Center Network (MLPCN), at least 300,000 compounds were screened using a TR-FRET method, an ALPHASCREE...
In DepthDetails US Patent