BDBM161395 US10124003, Ex. Compound 8::US10835536, Ex. Comp 8::US10894048, Ex Comp 8::US9108973, 8
SMILES CCOc1cc(OCC)cc(c1)C#Cc1nn([C@H]2CCN(C2)C(=O)C=C)c2ncnc(N)c12
InChI Key InChIKey=NCEXIPRXIVSSFW-KRWDZBQOSA-N
Data  4 IC50
  Tab Delimited (TSV)   2D SDfile   Computed 3D by Vconf -m prep SDfile
Find this compound or compounds like it in BindingDB:
Activity Spreadsheet -- Enzyme Inhibition Constant Data from BindingDB
Found 4 hits for monomerid = 161395
TargetFibroblast growth factor receptor 2(Homo sapiens (Human))
Taiho Pharmaceutical
US Patent
LigandPNGBDBM161395(US10124003, Ex. Compound 8 | US10835536, Ex. Comp ...)
Affinity DataIC50:  6.90nMpH: 7.5 T: 2°C. Assay description: When setting conditions for the measurement of the inhibitory effect of the compounds on FGFR2 kinase activity, FL-Peptide 22 (Caliper Life Sciences,...
In DepthDetails US Patent
TargetFibroblast growth factor receptor 2(Homo sapiens (Human))
Taiho Pharmaceutical
US Patent
LigandPNGBDBM161395(US10124003, Ex. Compound 8 | US10835536, Ex. Comp ...)
Affinity DataIC50:  6.90nM. Assay description: When setting conditions for the measurement of the inhibitory effect of the compounds on FGFR2 kinase activity, FL-Peptide 22 (Caliper Life Sciences,...
In DepthDetails US Patent
TargetFibroblast growth factor receptor 2(Homo sapiens (Human))
Taiho Pharmaceutical
US Patent
LigandPNGBDBM161395(US10124003, Ex. Compound 8 | US10835536, Ex. Comp ...)
Affinity DataIC50:  6.90nM. Assay description: When setting conditions for the measurement of the inhibitory effect of the compounds on FGFR2 kinase activity, FL-Peptide 22 (Caliper Life Sciences,...
In DepthDetails US Patent
TargetFibroblast growth factor receptor 2(Homo sapiens (Human))
Taiho Pharmaceutical
US Patent
LigandPNGBDBM161395(US10124003, Ex. Compound 8 | US10835536, Ex. Comp ...)
Affinity DataIC50:  6.90nM. Assay description: When setting conditions for the measurement of the inhibitory effect of the compounds on FGFR2 kinase activity, FL-Peptide 22 (Caliper Life Sciences,...
In DepthDetails US Patent