BDBM161416 US10124003, Ex. Compound 29::US10835536, Ex. Comp 29::US10894048, Ex Comp 29::US9108973, 29
SMILES COc1cc(OC)cc(c1)C#Cc1nn(CC2CN(C2)C(=O)C=C)c2ncnc(N)c12
InChI Key InChIKey=NLNSWQPNSJQAHU-UHFFFAOYSA-N
Data  6 IC50
  Tab Delimited (TSV)   2D SDfile   Computed 3D by Vconf -m prep SDfile
Find this compound or compounds like it in BindingDB:
Activity Spreadsheet -- Enzyme Inhibition Constant Data from BindingDB
Found 6 hits for monomerid = 161416
TargetFibroblast growth factor receptor 2(Homo sapiens (Human))
Taiho Pharmaceutical
US Patent
LigandPNGBDBM161416(US10124003, Ex. Compound 29 | US10835536, Ex. Comp...)
Affinity DataIC50:  9.30nMpH: 7.5 T: 2°C. Assay description: When setting conditions for the measurement of the inhibitory effect of the compounds on FGFR2 kinase activity, FL-Peptide 22 (Caliper Life Sciences,...
In DepthDetails US Patent
TargetFibroblast growth factor receptor 2(Homo sapiens (Human))
Taiho Pharmaceutical
US Patent
LigandPNGBDBM161416(US10124003, Ex. Compound 29 | US10835536, Ex. Comp...)
Affinity DataIC50:  9.30nM. Assay description: When setting conditions for the measurement of the inhibitory effect of the compounds on FGFR2 kinase activity, FL-Peptide 22 (Caliper Life Sciences,...
In DepthDetails US Patent
TargetVascular endothelial growth factor receptor 2(Homo sapiens (Human))TBA
LigandPNGBDBM161416(US10124003, Ex. Compound 29 | US10835536, Ex. Comp...)
Affinity DataIC50:  1.77E+3nM. Assay description: Inhibition of N-terminal GST tagged recombinant human VEGFR2 (aa805 to 1356 residues) expressed in baculovirus expression system using Poly- (Glu4:Ty...
In DepthDetails PubMed
TargetFibroblast growth factor receptor 2(Homo sapiens (Human))
Taiho Pharmaceutical
US Patent
LigandPNGBDBM161416(US10124003, Ex. Compound 29 | US10835536, Ex. Comp...)
Affinity DataIC50:  9.30nM. Assay description: When setting conditions for the measurement of the inhibitory effect of the compounds on FGFR2 kinase activity, FL-Peptide 22 (Caliper Life Sciences,...
In DepthDetails US Patent
TargetFibroblast growth factor receptor 2(Homo sapiens (Human))
Taiho Pharmaceutical
US Patent
LigandPNGBDBM161416(US10124003, Ex. Compound 29 | US10835536, Ex. Comp...)
Affinity DataIC50:  11nM. Assay description: Inhibition of human recombinant cytoplasmic domain FGFR2 (8 to 134 residues) incubated for 120 mins by mobility shift assay
In DepthDetails PubMed
TargetFibroblast growth factor receptor 2(Homo sapiens (Human))
Taiho Pharmaceutical
US Patent
LigandPNGBDBM161416(US10124003, Ex. Compound 29 | US10835536, Ex. Comp...)
Affinity DataIC50:  9.30nM. Assay description: When setting conditions for the measurement of the inhibitory effect of the compounds on FGFR2 kinase activity, FL-Peptide 22 (Caliper Life Sciences,...
In DepthDetails US Patent