BDBM163770 US9062070, 25
SMILES Fc1ccc([C@H]2CN3CCN(C[C@H]3CO2)C(=O)C2CCc3cc(ncc23)-n2cnnn2)c(F)c1[N+]#[C-]
InChI Key InChIKey=ZLXWSLPWPAEXHV-XNKIQEMOSA-N
Data  2 IC50
  Tab Delimited (TSV)   2D SDfile   Computed 3D by Vconf -m prep SDfile
Find this compound or compounds like it in BindingDB:
Activity Spreadsheet -- Enzyme Inhibition Constant Data from BindingDB
Found 2 hits for monomerid = 163770
TargetATP-sensitive inward rectifier potassium channel 1(Rattus norvegicus (Rat))
Merck Sharp & Dohme
US Patent
LigandPNGBDBM163770(US9062070, 25)
Affinity DataIC50:  100nMT: 2°C. Assay description: The ROMK channel functional thallium flux assay is performed in 384 wells, using the FLIPR-Tetra instrument. HEK-hKir1.1 cells are seeded in Poly-D-L...
In DepthDetails US Patent
TargetATP-sensitive inward rectifier potassium channel 1(Rattus norvegicus (Rat))
Merck Sharp & Dohme
US Patent
LigandPNGBDBM163770(US9062070, 25)
Affinity DataIC50:  60nMpH: 7.4Assay Description:Block of Kir1.1 (ROMK1) currents was examined by whole cell voltage clamp (Hamill et. al. Pfluegers Archives 391:85-100 (1981)) using the IonWorks Qu...
In DepthDetails US Patent