BDBM16467 2-{3-[(5,6-difluoro-1,3-benzothiazol-2-yl)methyl]-1H-indol-1-yl}acetic acid::Indoleacetic Acid Inhibitor 26
SMILES OC(=O)Cn1cc(Cc2nc3cc(F)c(F)cc3s2)c2ccccc12
InChI Key InChIKey=IZFXTCQBFZQKFW-UHFFFAOYSA-N
Data  2 IC50
  Tab Delimited (TSV)   2D SDfile   Computed 3D by Vconf -m prep SDfile
Find this compound or compounds like it in BindingDB:
Activity Spreadsheet -- Enzyme Inhibition Constant Data from BindingDB
Found 2 hits for monomerid = 16467
TargetAldo-keto reductase family 1 member A1(Homo sapiens (Human))
The Institute For Diabetes Discovery
LigandPNGBDBM16467(2-{3-[(5,6-difluoro-1,3-benzothiazol-2-yl)methyl]-...)
Affinity DataIC50:  1.30E+4nM. Assay description: The activity of the test enzyme was determined spectrophotometrically by monitoring the change in absorbance at 340 nm, which is due to the disappear...
In DepthDetails ArticlePubMed
TargetAldo-keto reductase family 1 member B1(Homo sapiens (Human))
The Institute For Diabetes Discovery
LigandPNGBDBM16467(2-{3-[(5,6-difluoro-1,3-benzothiazol-2-yl)methyl]-...)
Affinity DataIC50:  560nMpH: 6.6 T: 2°C. Assay description: The activity of the test enzyme was determined spectrophotometrically by monitoring the change in absorbance at 340 nm, which is due to the disappear...
In DepthDetails ArticlePubMed