BDBM16714 5-(2-acetylphenyl)-1-N-[(2S,3R)-3-hydroxy-1-phenyl-4-{[(1R)-1-phenylethyl]amino}butan-2-yl]-3-N-[(1R)-1-phenylethyl]benzene-1,3-dicarboxamide::Peptidomimetic HEA inhibitor, 23
SMILES C[C@@H](NC[C@@H](O)[C@H](Cc1ccccc1)NC(=O)c1cc(cc(c1)-c1ccccc1C(C)=O)C(=O)N[C@H](C)c1ccccc1)c1ccccc1
InChI Key InChIKey=OBKDIQQFGPQSMU-JYBRIGHHSA-N
Data  1 IC50
  Tab Delimited (TSV)   2D SDfile   Computed 3D by Vconf -m prep SDfile
Find this compound or compounds like it in BindingDB:
Activity Spreadsheet -- Enzyme Inhibition Constant Data from BindingDB
Found 1 hit for monomerid = 16714
TargetBeta-secretase 1(Homo sapiens (Human))
Merck Research Laboratories
LigandPNGBDBM16714(5-(2-acetylphenyl)-1-N-[(2S,3R)-3-hydroxy-1-phenyl...)
Affinity DataIC50:  348nMpH: 4.5 T: 2°C. Assay description: The assay was performed using a 96-well format on a HPLC equipped with four 96-well plate holders. Test compounds were preincubated with enzymes for ...
In DepthDetails ArticlePubMed