BDBM167516 US9073917, 13- comparative
SMILES CCOC(=O)c1[nH]cc2C(c3ccc(Sc4nc5cccc(OC)c5[nH]4)o3)C3=C(CCCC3=O)Nc12
InChI Key
Data  2 IC50
  Tab Delimited (TSV)   2D SDfile   Computed 3D by Vconf -m prep SDfile
Find this compound or compounds like it in BindingDB:
Activity Spreadsheet -- Enzyme Inhibition Constant Data from BindingDB
Found 2 hits for monomerid = 167516
TargetAurora kinase A(Homo sapiens (Human))
Sanofi
US Patent
LigandPNGBDBM167516(US9073917, 13- comparative)
Affinity DataIC50:  11nM. Assay description: The capacity to inhibit the kinase activity of the enzyme is estimated by measuring the residual kinase activity of the enzyme in the presence of dif...
In DepthDetails US Patent
TargetAurora kinase B/Inner centromere protein(Homo sapiens (Human))
Sanofi
US Patent
LigandPNGBDBM167516(US9073917, 13- comparative)
Affinity DataIC50:  10nM. Assay description: The capacity to inhibit the kinase activity of the enzyme is estimated by measuring the residual kinase activity of the enzyme in the presence of dif...
In DepthDetails US Patent