BDBM16754 2-[2-(adamantan-1-yl)-5-phenyl-1H-pyrrol-1-yl]-N-[(1Z)-amino[(3-hydroxypropyl)amino]methylidene]acetamide::Acylguanidine, 10b
SMILES OCCCNC(=N)NC(=O)Cn1c(ccc1C12CC3CC(CC(C3)C1)C2)-c1ccccc1
InChI Key InChIKey=CSKSXMSGBMJKQZ-UHFFFAOYSA-N
Data  6 IC50
  Tab Delimited (TSV)   2D SDfile   Computed 3D by Vconf -m prep SDfile
Find this compound or compounds like it in BindingDB:
Activity Spreadsheet -- Enzyme Inhibition Constant Data from BindingDB
Found 6 hits for monomerid = 16754
TargetBeta-secretase 1(Homo sapiens (Human))
Wyeth Research
LigandPNGBDBM16754(2-[2-(adamantan-1-yl)-5-phenyl-1H-pyrrol-1-yl]-N-[...)
Affinity DataIC50:  240nMpH: 4.5 T: 2°C. Assay description: A homogenous, continuous fluorescence resonance energy transfer (FRET) assay was used to assess compound inhibition of enzyme based on the cleavage o...
In DepthDetails ArticlePubMed
TargetBeta-secretase 2(Homo sapiens (Human))
Wyeth Research
LigandPNGBDBM16754(2-[2-(adamantan-1-yl)-5-phenyl-1H-pyrrol-1-yl]-N-[...)
Affinity DataIC50:  3.50E+3nMpH: 4.5 T: 2°C. Assay description: A homogenous, continuous fluorescence resonance energy transfer (FRET) assay was used to assess compound inhibition of enzyme based on the cleavage o...
In DepthDetails ArticlePubMed
TargetCathepsin D(Homo sapiens (Human))
Wyeth Research
Curated by ChEMBL
LigandPNGBDBM16754(2-[2-(adamantan-1-yl)-5-phenyl-1H-pyrrol-1-yl]-N-[...)
Affinity DataIC50:  1.99E+4nM. Assay description: Inhibition of cathepsin D
In DepthDetails ArticlePubMed
TargetPepsin A-4(Homo sapiens (Human))
Wyeth Research
LigandPNGBDBM16754(2-[2-(adamantan-1-yl)-5-phenyl-1H-pyrrol-1-yl]-N-[...)
Affinity DataIC50: >5.00E+4nMpH: 4.5 T: 2°C. Assay description: A homogenous, continuous fluorescence resonance energy transfer (FRET) assay was used to assess compound inhibition of enzyme based on the cleavage o...
In DepthDetails ArticlePubMed
TargetBeta-secretase 1(Homo sapiens (Human))
Wyeth Research
LigandPNGBDBM16754(2-[2-(adamantan-1-yl)-5-phenyl-1H-pyrrol-1-yl]-N-[...)
Affinity DataIC50:  239nM. Assay description: Inhibition of BACE1
In DepthDetails ArticlePubMed
TargetCathepsin D(Homo sapiens (Human))
Wyeth Research
Curated by ChEMBL
LigandPNGBDBM16754(2-[2-(adamantan-1-yl)-5-phenyl-1H-pyrrol-1-yl]-N-[...)
Affinity DataIC50:  1.94E+4nMpH: 4.5 T: 2°C. Assay description: A homogenous, continuous fluorescence resonance energy transfer (FRET) assay was used to assess compound inhibition of enzyme based on the cleavage o...
In DepthDetails ArticlePubMed