BDBM167558 US9073922, 43::US9796708, Example 43
SMILES Clc1ccc(NCC2CCCNC2)nc1-c1ccnc2[nH]c(cc12)C1CCNCC1
InChI Key
Data  2 IC50
  Tab Delimited (TSV)   2D SDfile   Computed 3D by Vconf -m prep SDfile
Find this compound or compounds like it in BindingDB:
Activity Spreadsheet -- Enzyme Inhibition Constant Data from BindingDB
Found 2 hits for monomerid = 167558
TargetCyclin-T1/Cyclin-dependent kinase 9(Homo sapiens (Human))
Abbvie
US Patent
LigandPNGBDBM167558(US9073922, 43 | US9796708, Example 43)
Affinity DataIC50:  170nM. Assay description: CDK9 enzyme activities were measured using LANCE ULight TR-FRET kinase assay reagents (PerkinElmer, Waltham, Mass.). Compounds were directly added in...
In DepthDetails US Patent
TargetCyclin-dependent kinase 9(Homo sapiens (Human))
Abbvie
US Patent
LigandPNGBDBM167558(US9073922, 43 | US9796708, Example 43)
Affinity DataIC50:  170nM. Assay description: CDK9 enzyme activities were measured using LANCE ULight TR-FRET kinase assay reagents (PerkinElmer, Waltham, Mass.). Compounds were directly added in...
In DepthDetails US Patent