BDBM16806 (2S)-2-[(2,6-dichlorophenyl)formamido]-3-[4-(5-methoxy-3-oxo-2-phenyl-2,3-dihydropyridazin-4-yl)phenyl]propanoic acid::pyridazinone-based antagonist, 8
SMILES COc1cnn(-c2ccccc2)c(=O)c1-c1ccc(C[C@H](NC(=O)c2c(Cl)cccc2Cl)C(O)=O)cc1
InChI Key InChIKey=FAXJBTWLKBIVML-NRFANRHFSA-N
Data  2 IC50
  Tab Delimited (TSV)   2D SDfile   Computed 3D by Vconf -m prep SDfile
Find this compound or compounds like it in BindingDB:
Activity Spreadsheet -- Enzyme Inhibition Constant Data from BindingDB
Found 2 hits for monomerid = 16806
TargetIntegrin alpha-4/beta-7(Homo sapiens (Human))
Johnson & Johnson Pharmaceutical
LigandPNGBDBM16806((2S)-2-[(2,6-dichlorophenyl)formamido]-3-[4-(5-met...)
Affinity DataIC50:  18nMT: 2°C. Assay description: M2 anti-FLAG antibody coated 96-well plates were coated with recombinant FLAG-hMAdCAM-1 contained in Dulbecco PBS. The compounds to be tested were ad...
In DepthDetails ArticlePubMed
TargetIntegrin alpha-4/beta-1 [T112H](Homo sapiens (Human))
Johnson & Johnson Pharmaceutical
LigandPNGBDBM16806((2S)-2-[(2,6-dichlorophenyl)formamido]-3-[4-(5-met...)
Affinity DataIC50:  3.90E+3nMpH: 7.4 T: 2°C. Assay description:  Immulon 96-well plates were coated with recombinant hVCAM-1 overnight at 4 C. Plates were washed and blocked for 1 h at room temperature in PBS-BSA....
In DepthDetails ArticlePubMed