BDBM17041 (3Z)-2-oxo-3-[1-(1H-pyrrol-2-yl)propylidene]-2,3-dihydro-1H-indole-5-sulfonamide::Indolinone based inhibitor, 4b
SMILES CC\C(=C1\C(=O)Nc2ccc(cc12)S(N)(=O)=O)c1ccc[nH]1
InChI Key InChIKey=UHSRDKFRLMBVOM-UVTDQMKNSA-N
Data  1 IC50
  Tab Delimited (TSV)   2D SDfile   Computed 3D by Vconf -m prep SDfile
Find this compound or compounds like it in BindingDB:
Activity Spreadsheet -- Enzyme Inhibition Constant Data from BindingDB
Found 1 hit for monomerid = 17041
Target3-phosphoinositide-dependent protein kinase 1(Homo sapiens (Human))
Berlex Biosciences
LigandPNGBDBM17041((3Z)-2-oxo-3-[1-(1H-pyrrol-2-yl)propylidene]-2,3-d...)
Affinity DataIC50:  14nM. Assay description: The coupled assay can detect inhibitors of AKT2 activation, as well as direct inhibitors of PDK1 or AKT2. Inactive AKT2 is activated in situ by incub...
In DepthDetails ArticlePubMed