BDBM173286 US9675605, 14
SMILES CCOC(=O)c1cnc2cc(OCc3ccc(F)c(F)c3)ccc2c1
InChI Key InChIKey=MSHSXXNDJMVVQT-UHFFFAOYSA-N
Data  1 EC50
  Tab Delimited (TSV)   2D SDfile   Computed 3D by Vconf -m prep SDfile
Find this compound or compounds like it in BindingDB:
Activity Spreadsheet -- Enzyme Inhibition Constant Data from BindingDB
Found 1 hit for monomerid = 173286
TargetAmine oxidase [flavin-containing] B(Homo sapiens (Human))
Dart Neuroscience (Cayman)
US Patent
LigandPNGBDBM173286(US9675605, 14)
Affinity DataEC50: <100nMpH: 7.4Assay Description:The MAO enzymatic assay was performed according to the fluorometric method described by Matsumoto and colleagues (Matsumoto et al., Clin. Biochem. 19...
Ligand InfoPC cidPC sid
In DepthDetails US Patent