BDBM173309 2-(7-((4-Fluorobenzyl)oxy)quinolin-3-yl)propan-2-ol::US9675605, 27
SMILES CC(C)(O)c1cnc2cc(OCc3ccc(F)cc3)ccc2c1
InChI Key InChIKey=LEUUWYVTPWYPGG-UHFFFAOYSA-N
Data  1 EC50
  Tab Delimited (TSV)   2D SDfile   Computed 3D by Vconf -m prep SDfile
Find this compound or compounds like it in BindingDB:
Activity Spreadsheet -- Enzyme Inhibition Constant Data from BindingDB
Found 1 hit for monomerid = 173309
TargetAmine oxidase [flavin-containing] B(Homo sapiens (Human))
Dart Neuroscience (Cayman)
US Patent
LigandPNGBDBM173309(2-(7-((4-Fluorobenzyl)oxy)quinolin-3-yl)propan-2-o...)
Affinity DataEC50: <100nMpH: 7.4Assay Description:The MAO enzymatic assay was performed according to the fluorometric method described by Matsumoto and colleagues (Matsumoto et al., Clin. Biochem. 19...
Ligand InfoPC cidPC sid
In DepthDetails US Patent