BDBM1743 2-Amino-6-arylthiobenzonitrile deriv. 1m::2-amino-6-[(3-fluorophenyl)sulfanyl]benzonitrile
SMILES Nc1cccc(Sc2cccc(F)c2)c1C#N
InChI Key InChIKey=ZJXCBXBCZFLMTP-UHFFFAOYSA-N
Data  4 IC50
  Tab Delimited (TSV)   2D SDfile   Computed 3D by Vconf -m prep SDfile
Find this compound or compounds like it in BindingDB:
Activity Spreadsheet -- Enzyme Inhibition Constant Data from BindingDB
Found 4 hits for monomerid = 1743
TargetGag-Pol polyprotein [588-1027]/[588-1147](Human immunodeficiency virus type 1)
Glaxosmithkline
LigandPNGBDBM1743(2-Amino-6-arylthiobenzonitrile deriv. 1m | 2-amino...)
Affinity DataIC50:  1.20E+4nMpH: 8.0Assay Description:The IC50 of reverse transcriptase is the concentration that inhibits 50% of recombinant HIV-1 RT RNA-directed DNA polymerase activity in vitro.
In DepthDetails ArticlePubMed
TargetReverse transcriptase(Human immunodeficiency virus 1)TBA
LigandPNGBDBM1743(2-Amino-6-arylthiobenzonitrile deriv. 1m | 2-amino...)
Affinity DataIC50:  1.20E+4nM. Assay description: Inhibition of HIV-1 reverse transcriptase
In DepthDetails Article
TargetReverse transcriptase(Human immunodeficiency virus 1)TBA
LigandPNGBDBM1743(2-Amino-6-arylthiobenzonitrile deriv. 1m | 2-amino...)
Affinity DataIC50:  1.20E+7nM. Assay description: Inhibition of HIV1 reverse transcriptase
In DepthDetails ArticlePubMed
TargetReverse transcriptase/RNaseH(Human immunodeficiency virus 1)
University Of Perugia
Curated by ChEMBL
LigandPNGBDBM1743(2-Amino-6-arylthiobenzonitrile deriv. 1m | 2-amino...)
Affinity DataIC50:  1.20E+4nM. Assay description: Inhibitory concentration against Reverse transcriptase
In DepthDetails ArticlePubMed