BDBM175333 1-(4-chlorophenyl)-2-(3,4-dihydroquinolin-1(2H)-yl)ethyl o-tolylcarbamate (6b)
SMILES Cc1ccccc1NC(=O)OC(CN1CCCc2ccccc12)c1ccc(Cl)cc1
InChI Key InChIKey=QXKKZOCMVAPFID-UHFFFAOYSA-N
Data  1 IC50
  Tab Delimited (TSV)   2D SDfile   Computed 3D by Vconf -m prep SDfile
Find this compound or compounds like it in BindingDB:
Activity Spreadsheet -- Enzyme Inhibition Constant Data from BindingDB
Found 1 hit for monomerid = 175333
TargetReverse transcriptase protein(Human immunodeficiency virus type 1 group M subtyp...)
Birla Institute of Technology
LigandPNGBDBM175333(1-(4-chlorophenyl)-2-(3,4-dihydroquinolin-1(2H)-yl...)
Affinity DataIC50:  8.12E+3nM. Assay description: The reaction mixture was set with template primer complex, RT enzyme and dNTPs in a lysis buffer with or without inhibitors. The reaction mixture was...
In DepthDetails ArticlePubMed