BDBM17699 2-aminobenzoxazole, 24::4-{[2-({4-chloro-3-[2-(diethylamino)ethoxy]phenyl}amino)-1,3-benzoxazol-5-yl]oxy}-N-methylpyridine-2-carboxamide
SMILES CCN(CC)CCOc1cc(Nc2nc3cc(Oc4ccnc(c4)C(=O)NC)ccc3o2)ccc1Cl
InChI Key InChIKey=PPIHIEHMPATSBJ-UHFFFAOYSA-N
Data  1 KI
  Tab Delimited (TSV)   2D SDfile   Computed 3D by Vconf -m prep SDfile
Find this compound or compounds like it in BindingDB:
Activity Spreadsheet -- Enzyme Inhibition Constant Data from BindingDB
Found 1 hit for monomerid = 17699
TargetVascular endothelial growth factor receptor 2(Homo sapiens (Human))
Amgen
LigandPNGBDBM17699(2-aminobenzoxazole, 24 | 4-{[2-({4-chloro-3-[2-(di...)
Affinity DataKi:  5nM. Assay description: The assay involves the phosphorylation of a biotinylated substrate and the detection of this phosphorylation after the addition of a streptavidin-all...
In DepthDetails ArticlePubMed