BDBM178092 {[7-(2,4-dichlorophenyl)-5-fluoro-2,3-dihydro-1-benzofuran-2-yl]methyl}(methyl)amine (Compound 4)
SMILES CNCC1Cc2cc(F)cc(c2O1)-c1ccc(Cl)cc1Cl
InChI Key InChIKey=LYHHUZTWGZOEKQ-UHFFFAOYSA-N
Data  2 IC50
  Tab Delimited (TSV)   2D SDfile   Computed 3D by Vconf -m prep SDfile
Find this compound or compounds like it in BindingDB:
Activity Spreadsheet -- Enzyme Inhibition Constant Data from BindingDB
Found 2 hits for monomerid = 178092
TargetAquaporin-1(Homo sapiens (Human))TBA
LigandPNGBDBM178092({[7-(2,4-dichlorophenyl)-5-fluoro-2,3-dihydro-1-be...)
Affinity DataIC50:  9.80E+3nM. Assay description: Inhibition of human AQP1 water channel expressed in CHO cells incubated for 10 mins by FLIPR Tetra assay
In DepthDetails PubMed
TargetAquaporin-1(Homo sapiens (Human))TBA
LigandPNGBDBM178092({[7-(2,4-dichlorophenyl)-5-fluoro-2,3-dihydro-1-be...)
Affinity DataIC50:  9.80E+3nM. Assay description: Osmotic water permeability was measured at 22-24 °C bymonitoring 90° scattered light intensity at 520 nm wavelength. Measurements were made using a P...
In DepthDetails ArticlePubMed