BDBM1788 2-Amino-6-arylthiobenzonitrile deriv. 3h::2-amino-6-[(2-chlorobenzene)sulfonyl]benzonitrile
SMILES Nc1cccc(c1C#N)S(=O)(=O)c1ccccc1Cl
InChI Key InChIKey=NXUSIYJXPBRFJT-UHFFFAOYSA-N
Data  4 IC50
  Tab Delimited (TSV)   2D SDfile   Computed 3D by Vconf -m prep SDfile
Find this compound or compounds like it in BindingDB:
Activity Spreadsheet -- Enzyme Inhibition Constant Data from BindingDB
Found 4 hits for monomerid = 1788
TargetGag-Pol polyprotein [588-1027]/[588-1147](Human immunodeficiency virus type 1)
Glaxosmithkline
LigandPNGBDBM1788(2-Amino-6-arylthiobenzonitrile deriv. 3h | 2-amino...)
Affinity DataIC50:  5.90E+3nM. Assay description: The IC50 of reverse transcriptase is the concentration that inhibits 50% of recombinant HIV-1 RT RNA-directed DNA polymerase activity in vitro.
In DepthDetails ArticlePubMed
TargetReverse transcriptase(Human immunodeficiency virus 1)TBA
LigandPNGBDBM1788(2-Amino-6-arylthiobenzonitrile deriv. 3h | 2-amino...)
Affinity DataIC50:  5.89E+3nM. Assay description: Inhibition of HIV-1 reverse transcriptase
In DepthDetails Article
TargetReverse transcriptase(Human immunodeficiency virus 1)TBA
LigandPNGBDBM1788(2-Amino-6-arylthiobenzonitrile deriv. 3h | 2-amino...)
Affinity DataIC50:  5.90E+6nM. Assay description: Inhibition of HIV1 reverse transcriptase
In DepthDetails ArticlePubMed
TargetReverse transcriptase/RNaseH(Human immunodeficiency virus 1)
University Of Perugia
Curated by ChEMBL
LigandPNGBDBM1788(2-Amino-6-arylthiobenzonitrile deriv. 3h | 2-amino...)
Affinity DataIC50:  5.89E+3nM. Assay description: Inhibitory concentration against Reverse transcriptase
In DepthDetails ArticlePubMed