BDBM180623 US8772323, 124
SMILES CC1CC(=O)NN=C1c1ccc2nc(oc2c1)-c1ccc(CN)cc1
InChI Key InChIKey=VYTLLZPFHUMCAY-UHFFFAOYSA-N
Data  1 EC50
  Tab Delimited (TSV)   2D SDfile   Computed 3D by Vconf -m prep SDfile
Find this compound or compounds like it in BindingDB:
Activity Spreadsheet -- Enzyme Inhibition Constant Data from BindingDB
Found 1 hit for monomerid = 180623
TargetGlucose-dependent insulinotropic receptor(Homo sapiens (Human))
Boehringer Ingelheim International
US Patent
LigandPNGBDBM180623(US8772323, 124)
Affinity DataEC50:  8.72E+3nMpH: 7.4 T: 2°C. Assay description: MIN6 cells [Miyazaki J et al. Endocrinology. 1990 July; 127(1):126-32] were stably transfected with an expression vector for human GPR119 cDNA (Acc. ...
In DepthDetails US Patent