BDBM180715 US8829029, 15
SMILES Fc1ccc2c(noc2c1)C1CCN(CC[C@H]2CC[C@@H](CC2)NC(=O)C2COc3ccccc3O2)CC1
InChI Key InChIKey=MDBJINZABFWALU-OAFSWBPASA-N
Data  2 KI
  Tab Delimited (TSV)   2D SDfile   Computed 3D by Vconf -m prep SDfile
Find this compound or compounds like it in BindingDB:
Activity Spreadsheet -- Enzyme Inhibition Constant Data from BindingDB
Found 2 hits for monomerid = 180715
Target5-hydroxytryptamine receptor 2A(Homo sapiens (Human))
Hoffmann-La Roche
US Patent
LigandPNGBDBM180715(US8829029, 15)
Affinity DataKi:  2.57nM. Assay description: Aliquots of membrane preparations were thawed at RT, resuspended in assay buffer (D2, D3: 50 mM Tris-HCl, 120 mM NaCl, 5 mM MgCl2, 1 mM EDTA, 5 mM KC...
Ligand InfoPC cidPC sid
In DepthDetails US Patent
TargetD(3) dopamine receptor(Homo sapiens (Human))
Hoffmann-La Roche
US Patent
LigandPNGBDBM180715(US8829029, 15)
Affinity DataKi:  12.7nM. Assay description: Aliquots of membrane preparations were thawed at RT, resuspended in assay buffer (D2, D3: 50 mM Tris-HCl, 120 mM NaCl, 5 mM MgCl2, 1 mM EDTA, 5 mM KC...
Ligand InfoPC cidPC sid
In DepthDetails US Patent