BDBM180716 US8829029, 16
SMILES Cc1ccn(CC(=O)N[C@H]2CC[C@H](CCN3CCC(CC3)c3noc4cc(F)ccc34)CC2)n1
InChI Key InChIKey=RLVPJHQAQHSEHQ-XYWHTSSQSA-N
Data  2 KI
  Tab Delimited (TSV)   2D SDfile   Computed 3D by Vconf -m prep SDfile
Find this compound or compounds like it in BindingDB:
Activity Spreadsheet -- Enzyme Inhibition Constant Data from BindingDB
Found 2 hits for monomerid = 180716
Target5-hydroxytryptamine receptor 2A(Homo sapiens (Human))
Hoffmann-La Roche
US Patent
LigandPNGBDBM180716(US8829029, 16)
Affinity DataKi:  2.79nM. Assay description: Aliquots of membrane preparations were thawed at RT, resuspended in assay buffer (D2, D3: 50 mM Tris-HCl, 120 mM NaCl, 5 mM MgCl2, 1 mM EDTA, 5 mM KC...
Ligand InfoPC cidPC sid
In DepthDetails US Patent
TargetD(3) dopamine receptor(Homo sapiens (Human))
Hoffmann-La Roche
US Patent
LigandPNGBDBM180716(US8829029, 16)
Affinity DataKi:  27.6nM. Assay description: Aliquots of membrane preparations were thawed at RT, resuspended in assay buffer (D2, D3: 50 mM Tris-HCl, 120 mM NaCl, 5 mM MgCl2, 1 mM EDTA, 5 mM KC...
Ligand InfoPC cidPC sid
In DepthDetails US Patent