BDBM181046 5'-O-(N-[3-(3-Oxo-1,3-dihydroisobenzofuran-1-yl)propanoyl]sulfamoyl)adenosine (9, Lactone)
SMILES Nc1ncnc2n(cnc12)[C@@H]1O[C@H](COS(=O)(=O)NC(=O)CCC2OC(=O)c3ccccc23)[C@@H](O)[C@H]1O
InChI Key InChIKey=JUBVXGIVIYTPKM-CYMTZGNCSA-N
Data  1 IC50
  Tab Delimited (TSV)   2D SDfile   Computed 3D by Vconf -m prep SDfile
Find this compound or compounds like it in BindingDB:
Activity Spreadsheet -- Enzyme Inhibition Constant Data from BindingDB
Found 1 hit for monomerid = 181046
Targeto-succinylbenzoate synthase(Escherichia coli K-12 (Enterobacteria))
Argonne National Laboratory
LigandPNGBDBM181046(5'-O-(N-[3-(3-Oxo-1,3-dihydroisobenzofuran-1-y...)
Affinity DataIC50: >1.00E+5nMpH: 7.4Assay Description:Enzyme inhibition studies were performed in 20 mM NaHPO4 buffer (pH 7.4) containing 150 mM NaCl and 1 mM MgCl2 using a MenE-MenB coupled assay in whi...
In DepthDetails ArticlePubMed