BDBM181962 US9145380, 165
SMILES COc1ncc(cn1)-c1cccc(c1)S(=O)(=O)Nc1ccccc1S(N)(=O)=O
InChI Key InChIKey=TVAJCUPDVAXVLP-UHFFFAOYSA-N
Data  1 IC50
  Tab Delimited (TSV)   2D SDfile   Computed 3D by Vconf -m prep SDfile
Find this compound or compounds like it in BindingDB:
Activity Spreadsheet -- Enzyme Inhibition Constant Data from BindingDB
Found 1 hit for monomerid = 181962
TargetProstaglandin E synthase 2(Homo sapiens (Human))
Astrazeneca
US Patent
LigandPNGBDBM181962(US9145380, 165)
Affinity DataIC50:  2.30E+3nMpH: 6.8Assay Description:A solution of test compound was added to a diluted microsome preparation containing human mPGES-1 and pre-incubated for 15 minutes in potassium phosp...
Ligand InfoPC cidPC sid
In DepthDetails US Patent